{"text_format":"1","workbook":"xlsx","n_sheets":9,"sheets":["Entry","Instructions","Calculations","FRE","Table 1B","Table 2B","Table 3B","Table 3C","CPI-U Index"],"not_rendered":{"charts":0,"images":1,"macros":1,"external_links":0,"defined_names":16,"comments":0,"pivot_tables":0},"unopened":[],"bounds":{"document_bytes":16777216,"sheet_cells":100000,"rows_first":2000,"rows_last":500,"rows_between":2000,"halvings":0,"cell_chars":16384,"cell_head_chars":4096},"cells_cut":0,"cells_raw":0,"read":"whole","date_system":"1900"}

{"sheet":"Entry","index":0,"n_rows":86,"n_cols":18,"rows_kept":86,"cut":false,"hidden":false,"merged":[[51,7,51,12],[47,7,47,12],[18,1,19,3],[45,7,45,12],[46,7,46,12],[49,7,49,12],[50,7,50,12],[43,7,43,12],[39,7,39,12],[34,7,37,12],[20,7,20,8],[22,7,22,8],[28,7,28,8],[29,7,29,8],[32,7,32,8],[25,7,25,8],[4,8,5,8],[4,9,5,9],[7,0,7,1],[8,0,8,1],[9,0,9,1],[1,13,2,13],[4,13,5,13],[13,0,13,1],[14,0,14,1],[17,0,17,1],[15,0,15,1],[16,0,16,1],[0,0,3,1],[7,2,7,5],[4,10,5,10],[4,11,5,11],[4,12,5,12],[1,7,2,12],[11,0,11,1],[12,0,12,1],[5,0,5,4],[40,7,40,12],[41,7,41,12],[42,7,42,12],[17,7,17,8],[18,7,18,8],[19,7,19,8],[30,7,30,8],[31,7,31,8],[26,7,26,8],[27,7,27,8],[23,7,23,8],[24,7,24,8]]}
["Accelerated Payment Estimator Tier 2",null,null,null,null,null,null,null,null,null,null,null,null,null,null,null,null,"2011-01-01"]
[null,null,null,null,null,null,null,{"$f":"CONCATENATE(\"Accelerated Payment Estimate Calculation for \",PROPER(C8))","v":"Accelerated Payment Estimate Calculation for "},null,null,null,null,null,"Tier 2"]
[]
[]
[null,null,null,null,null,null,null,null,"Wage Period","Wages for Pension","Increase","Allowable Wage Increase","Excess","Wages as Entered"]
["Estimator only Applicable for Tier 2 Regular retirements (Not Applicable for ECO or SLEP)"]
[null,null,null,null,null,null,null,"Base Year",{"$f":"CONCATENATE(TEXT(VLOOKUP(1,FRE!$B$14:$C$133,2,FALSE),\"mmmm yyyy\"),\" - \",TEXT(VLOOKUP(12,FRE!$B$14:$C$133,2,FALSE),\"mmmm yyyy\"))","v":{"$error":"#N/A"}},{"$f":"SUMIF(FRE!$A$14:$A$133,1,FRE!$H$14:$H$133)","v":0},null,null,null,{"$f":"SUMIF(FRE!$A$14:$A$133,1,FRE!$D$14:$D$133)","v":0}]
["Member's Name",null,null,null,null,null,null,"Year 1",{"$f":"CONCATENATE(TEXT(VLOOKUP(13,FRE!$B$14:$C$133,2,FALSE),\"mmmm yyyy\"),\" - \",TEXT(VLOOKUP(24,FRE!$B$14:$C$133,2,FALSE),\"mmmm yyyy\"))","v":{"$error":"#N/A"}},{"$f":"SUMIF(FRE!$A$14:$A$133,2,FRE!$H$14:$H$133)","v":0},{"$f":"J8-J7","v":0},{"$f":"J7*Calculations!D56","v":{"$error":"#N/A"}},{"$f":"IF(VLOOKUP(13,FRE!$B$14:$C$133,2,FALSE)<$R$1,0,IF(K8>L8,K8-L8,0))","v":{"$error":"#N/A"}},{"$f":"SUMIF(FRE!$A$14:$A$133,2,FRE!$D$14:$D$133)","v":0}]
["Member's Date of Birth",null,null,null,null,null,null,"Year 2",{"$f":"CONCATENATE(TEXT(VLOOKUP(25,FRE!$B$14:$C$133,2,FALSE),\"mmmm yyyy\"),\" - \",TEXT(VLOOKUP(36,FRE!$B$14:$C$133,2,FALSE),\"mmmm yyyy\"))","v":{"$error":"#N/A"}},{"$f":"SUMIF(FRE!$A$14:$A$133,3,FRE!$H$14:$H$133)","v":0},{"$f":"J9-J8","v":0},{"$f":"J8*Calculations!D57","v":{"$error":"#N/A"}},{"$f":"IF(VLOOKUP(25,FRE!$B$14:$C$133,2,FALSE)<$R$1,0,IF(K9>L9,K9-L9,0))","v":{"$error":"#N/A"}},{"$f":"SUMIF(FRE!$A$14:$A$133,3,FRE!$D$14:$D$133)","v":0}]
["Member's Estimated Termination Date",null,null,null,null,null,null,"Year 3",{"$f":"CONCATENATE(TEXT(VLOOKUP(37,FRE!$B$14:$C$133,2,FALSE),\"mmmm yyyy\"),\" - \",TEXT(VLOOKUP(48,FRE!$B$14:$C$133,2,FALSE),\"mmmm yyyy\"))","v":{"$error":"#N/A"}},{"$f":"SUMIF(FRE!$A$14:$A$133,4,FRE!$H$14:$H$133)","v":0},{"$f":"J10-J9","v":0},{"$f":"J9*Calculations!D58","v":{"$error":"#N/A"}},{"$f":"IF(VLOOKUP(37,FRE!$B$14:$C$133,2,FALSE)<$R$1,0,IF(K10>L10,K10-L10,0))","v":{"$error":"#N/A"}},{"$f":"SUMIF(FRE!$A$14:$A$133,4,FRE!$D$14:$D$133)","v":0}]
{"$rows_left_out":77}
{"sheet":"Instructions","index":1,"n_rows":69,"n_cols":17,"rows_kept":69,"cut":false,"hidden":false,"merged":[[68,1,68,9],[52,2,52,9],[54,1,54,9],[56,1,56,9],[58,1,58,9],[62,1,62,9],[66,2,66,9],[48,1,48,9],[50,1,50,9],[33,1,33,6],[33,9,33,14],[31,1,31,6],[28,7,29,7],[28,8,29,8],[28,9,29,14],[31,9,31,14],[37,0,37,9],[28,1,29,6],[26,1,26,6],[9,0,10,6],[11,9,12,14],[0,0,0,9],[1,0,1,9],[2,1,2,8],[4,0,4,9],[5,0,5,9],[26,9,26,14],[16,1,18,6],[14,9,14,14],[16,9,18,14],[20,9,20,14],[22,9,22,14],[24,9,24,14],[11,7,12,7],[6,0,6,9],[14,1,14,6],[20,1,20,6],[22,1,22,6],[24,1,24,6],[11,1,12,6],[11,8,12,8],[16,7,18,7],[16,8,18,8]]}
["Accelerated Payment Estimator"]
["This spreadsheet was created to help employers estimate the amount of any Accelerated Payment (AP) that may arise due to higher than normal increases to reported wages. Please NOTE: The AP is not due at the time of the increase but only when the member retires. For additional information, including  exceptions to the AP, please review  the AP topic at "]
[null,"https://www.imrf.org/en/employers/employer-tasks/accelerated-payments"]
[]
["Special Situations May Affect This Estimator"]
["This spreadsheet only provides an estimate of a possible AP. Many variables can affect the actual AP; all of the variables could not be programmed into this spreadsheet."]
[" Your actual AP may be different, either higher or lower, than this estimate. "]
[]
["Please verify that this spreadsheet is appropriate for your specific situation"]
["THIS SPREADSHEET IS NOT PROGRAMMED TO ACCURATELY ESTIMATE AN AP WITH THIS CONDITION",null,null,null,null,null,null,null,null,null,null,null,null,null,null,{"$f":"COUNTIF(P12:P36,\"=TRUE\")","v":0}]
{"$rows_left_out":60}
{"sheet":"Calculations","index":2,"n_rows":63,"n_cols":10,"rows_kept":63,"cut":false,"hidden":true,"merged":[]}
[null,null,null,null,"Male","Regular","Married"]
[null,"Initial Retirement Date",{"$f":"DATE(YEAR(Entry!C10),MONTH(Entry!C10)+1,DAY(1))","v":"1900-02-01"},null,"Female","SLEP","Single"]
[null,null,null,null,null,null,"Divorced"]
[null,"RG01 Retirement Date",{"$f":"DATE(YEAR($C$9)+62,MONTH($C$9)+1,DAY(1))","v":"1962-02-01"},null,null,null,"Widowed"]
[null,"SLEP Retirement Date",{"$f":"DATE(YEAR($C$9)+50,MONTH($C$9)+1,DAY(1))","v":"1950-02-01"}]
[]
[null,"Calculated Retirment Date",{"$f":"IF(AND(Entry!C18=\"Regular\",Calculations!C2<Calculations!C4),Calculations!C4,IF(AND(Entry!C18=\"SLEP\",Calculations!C2<Calculations!C5),Calculations!C5,Calculations!C2))","v":"1962-02-01"}]
[]
[null,"Birth Date",{"$f":"Entry!C9","v":"00:00:00"}]
[]
{"$rows_left_out":54}
{"sheet":"FRE","index":3,"n_rows":135,"n_cols":12,"rows_kept":135,"cut":false,"hidden":true,"merged":[]}
[null,"Count","Month/Year","Wages","125% Rule Max","125% of  Max","48 Month Total","FRE Wage","Annual FRE","Monthly FRE","48 Month Start",{"$f":"CONCATENATE(L59,\" \",L60)","v":" "}]
[{"$f":"INT((B2+11)/12)","v":0},{"$f":"IF(AND(L108=\"\",L109=\" MAX\"),1,IF(AND(B1>=1,B1<109),B1+1,0))","v":0},{"$f":"Entry!A21","v":{"$error":"#NUM!"}},{"$f":"Entry!B21","v":0},null,null,null,{"$f":"IF(AND($D2>$F5,$L5=\" MAX\"),$F5,IF(AND($D2>$F4,$L4=\" MAX\"),$F4,IF(AND($D2>$F3,$L3=\" MAX\"),$F3,IF(AND($D2>$F2,$L2=\" MAX\"),$F2,$D2))))","v":0}]
[0,{"$f":"IF(AND(L109=\"\",L110=\" MAX\"),1,IF(AND(B2>=1,B2<109),B2+1,0))","v":0},{"$f":"Entry!A22","v":{"$error":"#NUM!"}},{"$f":"Entry!B22","v":0},null,null,null,0]
[0,0,{"$f":"Entry!A23","v":{"$error":"#NUM!"}},{"$f":"Entry!B23","v":0},null,null,null,0]
[0,0,{"$f":"Entry!A24","v":{"$error":"#NUM!"}},{"$f":"Entry!B24","v":0},null,null,null,0]
[0,0,{"$f":"Entry!A25","v":{"$error":"#NUM!"}},{"$f":"Entry!B25","v":0},null,null,null,0]
[0,0,{"$f":"Entry!A26","v":{"$error":"#NUM!"}},{"$f":"Entry!B26","v":0},null,null,null,0]
[0,0,{"$f":"Entry!A27","v":{"$error":"#NUM!"}},{"$f":"Entry!B27","v":0},null,null,null,0]
[0,0,{"$f":"Entry!A28","v":{"$error":"#NUM!"}},{"$f":"Entry!B28","v":0},null,null,null,0]
[0,0,{"$f":"Entry!A29","v":{"$error":"#NUM!"}},{"$f":"Entry!B29","v":0},null,null,null,0]
{"$rows_left_out":126}
{"sheet":"Table 1B","index":4,"n_rows":129,"n_cols":12,"rows_kept":129,"cut":false,"hidden":true,"merged":[]}
[null,null,null,null,"Illinois Municipal Retirement Fund",null,null,null,"Table 1B - Tier 2 Only",null,null,"2018 table"]
[]
[null,null,null,null,"FACTOR FOR DETERMINING THE COST OF FORMULA LIFE ANNUITY PAYABLE TO ",null,null,null,null,null,"Age",{"$f":"Calculations!B15","v":{"$error":"#VALUE!"}}]
[null,null,null,null,"MALE EMPLOYEES WITH ELIGIBLE SPOUSE TERMINATING ON OR AFTER",null,null,null,null,null,"Factor",{"$f":"VLOOKUP(INT(L3),B60:D129,2)-ROUND(((L3-INT(L3))*VLOOKUP(INT(L3),B60:D129,3)),5)","v":{"$error":"#VALUE!"}}]
[null,null,null,null,"SEPTEMBER 8, 1971*",null,null,null,null,null,"Mtly Bft",1388]
[null,null,null,null,null,null,null,null,null,null,"PV",{"$f":"ROUND(L4*L5,2)","v":{"$error":"#VALUE!"}}]
[null,"Age","Factor","Difference",null,"Age","Factor","Difference"]
[]
[null,30,167.76,0.26999999999998181,null,65,147.38,0.96999999999999886]
[null,31,167.49,0.28000000000000114,null,66,146.41,2.4799999999999898]
{"$rows_left_out":120}
{"sheet":"Table 2B","index":5,"n_rows":124,"n_cols":12,"rows_kept":124,"cut":false,"hidden":true,"merged":[]}
[null,null,null,null,"Illinois Municipal Retirement Fund",null,null,null,"Table 2B - Tier 2 Only",null,null,"2018 Table"]
[]
[null,null,null,null,"FACTOR FOR DETERMINING THE COST OF FORMULA LIFE ANNUITY PAYABLE TO MALE",null,null,null,null,null,"Age",{"$f":"Calculations!B15","v":{"$error":"#VALUE!"}}]
[null,null,null,null,"EMPLOYEES WITHOUT ELIGIBLE SPOUSE TERMINATING ON OR AFTER SEPTEMBER 8, 1971*",null,null,null,null,null,"Factor",{"$f":"VLOOKUP(INT(L3),B55:D124,2)-ROUND(((L3-INT(L3))*VLOOKUP(INT(L3),B55:D124,3)),5)","v":{"$error":"#VALUE!"}}]
[null,null,null,null,null,null,null,null,null,null,"Mtly Bft",1388]
[null,"Age","Factor","Difference",null,"Age","Factor","Difference",null,null,"PV",{"$f":"ROUND(L4*L5,2)","v":{"$error":"#VALUE!"}}]
[]
[null,30,162.44,0.56000000000000227,null,65,123.94,1.7199999999999989]
[null,31,161.88,0.59000000000000341,null,66,122.22,2.980000000000004]
[null,32,161.29,0.62999999999999545,null,67,119.24,3.0799999999999983]
{"$rows_left_out":115}
{"sheet":"Table 3B","index":6,"n_rows":124,"n_cols":12,"rows_kept":124,"cut":false,"hidden":true,"merged":[]}
[null,null,null,null,"Illinois Municipal Retirement Fund",null,null,null,"Table 3B - Tier 2 Only",null,null,"2018 Tables"]
[]
[null,null,null,null,"FACTOR FOR DETERMINING THE COST OF FORMULA LIFE ANNUITY PAYABLE TO FEMALE",null,null,null,null,null,"Age",{"$f":"Calculations!B15","v":{"$error":"#VALUE!"}}]
[null,null,null,null,"EMPLOYEES WITHOUT ELIGIBLE SPOUSE TERMINATING ON OR AFTER SEPTEMBER 8, 1971*",null,null,null,null,null,"Factor",{"$f":"VLOOKUP(INT(L3),B55:D124,2)-ROUND(((L3-INT(L3))*VLOOKUP(INT(L3),B55:D124,3)),5)","v":{"$error":"#VALUE!"}}]
[null,null,null,null,null,null,null,null,null,null,"Mtly Bft",1388]
[null,"Age","Factor","Difference",null,"Age","Factor","Difference",null,null,"PV",{"$f":"ROUND(L4*L5,2)","v":{"$error":"#VALUE!"}}]
[]
[null,30,null,0,null,65,138.02000000000001,1.4900000000000091]
[null,31,null,0,null,66,136.53,2.9099999999999966]
[null,32,null,0,null,67,133.62,3.0300000000000011]
{"$rows_left_out":115}
{"sheet":"Table 3C","index":7,"n_rows":164,"n_cols":11,"rows_kept":164,"cut":false,"hidden":true,"merged":[]}
[null,null,null,null,"Illinois Municipal Retirement Fund",null,null,null,"Table 3C"]
[]
[null,null,null,null,"FACTOR FOR DETERMINING THE COST OF FORMULA LIFE ANNUITY PAYABLE TO FEMALE"]
[null,null,null,null,"EMPLOYEES WITH ELIGIBLE SPOUSE TERMINATING ON OR AFTER JULY 27, 1972*"]
[null,null,null,null,null,null,null,null,null,null,"2018 table"]
[null,"Age","Factor","Difference",null,"Age","Factor","Difference"]
[]
[null,35,167.15,0.31999999999999318,null,65,147.13999999999999,1.2199999999999989,null,"Age",{"$f":"Calculations!B15","v":{"$error":"#VALUE!"}}]
[null,36,166.83,0.35000000000002274,null,66,145.91999999999999,2.7299999999999898,null,"Factor",{"$f":"VLOOKUP(INT(K8),B100:D164,2)-ROUND(((K8-INT(K8))*VLOOKUP(INT(K8),B100:D164,3)),5)","v":{"$error":"#VALUE!"}}]
[null,37,166.48,0.35999999999998522,null,67,143.19,2.8499999999999943,null,"Mtly Bft",185.7]
{"$rows_left_out":155}
{"sheet":"CPI-U Index","index":8,"n_rows":44,"n_cols":14,"rows_kept":44,"cut":false,"hidden":true,"merged":[]}
[]
[{"$f":"IF(AND($I2<=Calculations!$B$56,'CPI-U Index'!$J2>=Calculations!$B$56),1,0)","v":{"$error":"#N/A"}},{"$f":"IF(AND($I2<=Calculations!$B$57,'CPI-U Index'!$J2>=Calculations!$B$57),1,0)","v":{"$error":"#N/A"}},{"$f":"IF(AND($I2<=Calculations!$B$58,'CPI-U Index'!$J2>=Calculations!$B$58),1,0)","v":{"$error":"#N/A"}},{"$f":"IF(AND($I2<=Calculations!$B$59,'CPI-U Index'!$J2>=Calculations!$B$59),1,0)","v":{"$error":"#N/A"}},{"$f":"IF(AND($I2<=Calculations!$B$60,'CPI-U Index'!$J2>=Calculations!$B$60),1,0)","v":{"$error":"#N/A"}},{"$f":"IF(AND($I2<=Calculations!$B$61,'CPI-U Index'!$J2>=Calculations!$B$61),1,0)","v":{"$error":"#N/A"}},{"$f":"IF(AND($I2<=Calculations!$B$62,'CPI-U Index'!$J2>=Calculations!$B$62),1,0)","v":{"$error":"#N/A"}},{"$f":"IF(AND($I2<=Calculations!$B$63,'CPI-U Index'!$J2>=Calculations!$B$63),1,0)","v":{"$error":"#N/A"}},"2008-10-01","2009-09-30",4.9000000000000002E-2,{"$f":"K2*1.5","v":7.350000000000001E-2},0.06,{"$f":"MAX(L2:M2)","v":7.350000000000001E-2}]
[{"$f":"IF(AND($I3<=Calculations!$B$56,'CPI-U Index'!$J3>=Calculations!$B$56),1,0)","v":{"$error":"#N/A"}},{"$f":"IF(AND($I3<=Calculations!$B$57,'CPI-U Index'!$J3>=Calculations!$B$57),1,0)","v":{"$error":"#N/A"}},{"$f":"IF(AND($I3<=Calculations!$B$58,'CPI-U Index'!$J3>=Calculations!$B$58),1,0)","v":{"$error":"#N/A"}},{"$f":"IF(AND($I3<=Calculations!$B$59,'CPI-U Index'!$J3>=Calculations!$B$59),1,0)","v":{"$error":"#N/A"}},{"$f":"IF(AND($I3<=Calculations!$B$60,'CPI-U Index'!$J3>=Calculations!$B$60),1,0)","v":{"$error":"#N/A"}},{"$f":"IF(AND($I3<=Calculations!$B$61,'CPI-U Index'!$J3>=Calculations!$B$61),1,0)","v":{"$error":"#N/A"}},{"$f":"IF(AND($I3<=Calculations!$B$62,'CPI-U Index'!$J3>=Calculations!$B$62),1,0)","v":{"$error":"#N/A"}},{"$f":"IF(AND($I3<=Calculations!$B$63,'CPI-U Index'!$J3>=Calculations!$B$63),1,0)","v":{"$error":"#N/A"}},"2009-10-01","2010-09-30",-1.2999999999999999E-2,{"$f":"K3*1.5","v":-1.95E-2},0.06,{"$f":"MAX(L3:M3)","v":0.06}]
[{"$f":"IF(AND($I4<=Calculations!$B$56,'CPI-U Index'!$J4>=Calculations!$B$56),1,0)","v":{"$error":"#N/A"}},{"$f":"IF(AND($I4<=Calculations!$B$57,'CPI-U Index'!$J4>=Calculations!$B$57),1,0)","v":{"$error":"#N/A"}},{"$f":"IF(AND($I4<=Calculations!$B$58,'CPI-U Index'!$J4>=Calculations!$B$58),1,0)","v":{"$error":"#N/A"}},{"$f":"IF(AND($I4<=Calculations!$B$59,'CPI-U Index'!$J4>=Calculations!$B$59),1,0)","v":{"$error":"#N/A"}},{"$f":"IF(AND($I4<=Calculations!$B$60,'CPI-U Index'!$J4>=Calculations!$B$60),1,0)","v":{"$error":"#N/A"}},{"$f":"IF(AND($I4<=Calculations!$B$61,'CPI-U Index'!$J4>=Calculations!$B$61),1,0)","v":{"$error":"#N/A"}},{"$f":"IF(AND($I4<=Calculations!$B$62,'CPI-U Index'!$J4>=Calculations!$B$62),1,0)","v":{"$error":"#N/A"}},{"$f":"IF(AND($I4<=Calculations!$B$63,'CPI-U Index'!$J4>=Calculations!$B$63),1,0)","v":{"$error":"#N/A"}},"2010-10-01","2011-09-30",1.0999999999999999E-2,1.6500000000000001E-2,0.06,0.06]
[{"$f":"IF(AND($I5<=Calculations!$B$56,'CPI-U Index'!$J5>=Calculations!$B$56),1,0)","v":{"$error":"#N/A"}},{"$f":"IF(AND($I5<=Calculations!$B$57,'CPI-U Index'!$J5>=Calculations!$B$57),1,0)","v":{"$error":"#N/A"}},{"$f":"IF(AND($I5<=Calculations!$B$58,'CPI-U Index'!$J5>=Calculations!$B$58),1,0)","v":{"$error":"#N/A"}},{"$f":"IF(AND($I5<=Calculations!$B$59,'CPI-U Index'!$J5>=Calculations!$B$59),1,0)","v":{"$error":"#N/A"}},{"$f":"IF(AND($I5<=Calculations!$B$60,'CPI-U Index'!$J5>=Calculations!$B$60),1,0)","v":{"$error":"#N/A"}},{"$f":"IF(AND($I5<=Calculations!$B$61,'CPI-U Index'!$J5>=Calculations!$B$61),1,0)","v":{"$error":"#N/A"}},{"$f":"IF(AND($I5<=Calculations!$B$62,'CPI-U Index'!$J5>=Calculations!$B$62),1,0)","v":{"$error":"#N/A"}},{"$f":"IF(AND($I5<=Calculations!$B$63,'CPI-U Index'!$J5>=Calculations!$B$63),1,0)","v":{"$error":"#N/A"}},"2011-10-01","2012-09-30",3.9E-2,5.8499999999999996E-2,0.06,0.06]
[{"$f":"IF(AND($I6<=Calculations!$B$56,'CPI-U Index'!$J6>=Calculations!$B$56),1,0)","v":{"$error":"#N/A"}},{"$f":"IF(AND($I6<=Calculations!$B$57,'CPI-U Index'!$J6>=Calculations!$B$57),1,0)","v":{"$error":"#N/A"}},{"$f":"IF(AND($I6<=Calculations!$B$58,'CPI-U Index'!$J6>=Calculations!$B$58),1,0)","v":{"$error":"#N/A"}},{"$f":"IF(AND($I6<=Calculations!$B$59,'CPI-U Index'!$J6>=Calculations!$B$59),1,0)","v":{"$error":"#N/A"}},{"$f":"IF(AND($I6<=Calculations!$B$60,'CPI-U Index'!$J6>=Calculations!$B$60),1,0)","v":{"$error":"#N/A"}},{"$f":"IF(AND($I6<=Calculations!$B$61,'CPI-U Index'!$J6>=Calculations!$B$61),1,0)","v":{"$error":"#N/A"}},{"$f":"IF(AND($I6<=Calculations!$B$62,'CPI-U Index'!$J6>=Calculations!$B$62),1,0)","v":{"$error":"#N/A"}},{"$f":"IF(AND($I6<=Calculations!$B$63,'CPI-U Index'!$J6>=Calculations!$B$63),1,0)","v":{"$error":"#N/A"}},"2012-10-01","2013-09-30",0.02,0.03,0.06,0.06]
[{"$f":"IF(AND($I7<=Calculations!$B$56,'CPI-U Index'!$J7>=Calculations!$B$56),1,0)","v":{"$error":"#N/A"}},{"$f":"IF(AND($I7<=Calculations!$B$57,'CPI-U Index'!$J7>=Calculations!$B$57),1,0)","v":{"$error":"#N/A"}},{"$f":"IF(AND($I7<=Calculations!$B$58,'CPI-U Index'!$J7>=Calculations!$B$58),1,0)","v":{"$error":"#N/A"}},{"$f":"IF(AND($I7<=Calculations!$B$59,'CPI-U Index'!$J7>=Calculations!$B$59),1,0)","v":{"$error":"#N/A"}},{"$f":"IF(AND($I7<=Calculations!$B$60,'CPI-U Index'!$J7>=Calculations!$B$60),1,0)","v":{"$error":"#N/A"}},{"$f":"IF(AND($I7<=Calculations!$B$61,'CPI-U Index'!$J7>=Calculations!$B$61),1,0)","v":{"$error":"#N/A"}},{"$f":"IF(AND($I7<=Calculations!$B$62,'CPI-U Index'!$J7>=Calculations!$B$62),1,0)","v":{"$error":"#N/A"}},{"$f":"IF(AND($I7<=Calculations!$B$63,'CPI-U Index'!$J7>=Calculations!$B$63),1,0)","v":{"$error":"#N/A"}},"2013-10-01","2014-09-30",1.2E-2,1.8000000000000002E-2,0.06,0.06]
[{"$f":"IF(AND($I8<=Calculations!$B$56,'CPI-U Index'!$J8>=Calculations!$B$56),1,0)","v":{"$error":"#N/A"}},{"$f":"IF(AND($I8<=Calculations!$B$57,'CPI-U Index'!$J8>=Calculations!$B$57),1,0)","v":{"$error":"#N/A"}},{"$f":"IF(AND($I8<=Calculations!$B$58,'CPI-U Index'!$J8>=Calculations!$B$58),1,0)","v":{"$error":"#N/A"}},{"$f":"IF(AND($I8<=Calculations!$B$59,'CPI-U Index'!$J8>=Calculations!$B$59),1,0)","v":{"$error":"#N/A"}},{"$f":"IF(AND($I8<=Calculations!$B$60,'CPI-U Index'!$J8>=Calculations!$B$60),1,0)","v":{"$error":"#N/A"}},{"$f":"IF(AND($I8<=Calculations!$B$61,'CPI-U Index'!$J8>=Calculations!$B$61),1,0)","v":{"$error":"#N/A"}},{"$f":"IF(AND($I8<=Calculations!$B$62,'CPI-U Index'!$J8>=Calculations!$B$62),1,0)","v":{"$error":"#N/A"}},{"$f":"IF(AND($I8<=Calculations!$B$63,'CPI-U Index'!$J8>=Calculations!$B$63),1,0)","v":{"$error":"#N/A"}},"2014-10-01","2015-09-30",1.7000000000000001E-2,2.5500000000000002E-2,0.06,0.06]
[{"$f":"IF(AND($I9<=Calculations!$B$56,'CPI-U Index'!$J9>=Calculations!$B$56),1,0)","v":{"$error":"#N/A"}},{"$f":"IF(AND($I9<=Calculations!$B$57,'CPI-U Index'!$J9>=Calculations!$B$57),1,0)","v":{"$error":"#N/A"}},{"$f":"IF(AND($I9<=Calculations!$B$58,'CPI-U Index'!$J9>=Calculations!$B$58),1,0)","v":{"$error":"#N/A"}},{"$f":"IF(AND($I9<=Calculations!$B$59,'CPI-U Index'!$J9>=Calculations!$B$59),1,0)","v":{"$error":"#N/A"}},{"$f":"IF(AND($I9<=Calculations!$B$60,'CPI-U Index'!$J9>=Calculations!$B$60),1,0)","v":{"$error":"#N/A"}},{"$f":"IF(AND($I9<=Calculations!$B$61,'CPI-U Index'!$J9>=Calculations!$B$61),1,0)","v":{"$error":"#N/A"}},{"$f":"IF(AND($I9<=Calculations!$B$62,'CPI-U Index'!$J9>=Calculations!$B$62),1,0)","v":{"$error":"#N/A"}},{"$f":"IF(AND($I9<=Calculations!$B$63,'CPI-U Index'!$J9>=Calculations!$B$63),1,0)","v":{"$error":"#N/A"}},"2015-10-01","2016-09-30",0,0,0.06,0.06]
[{"$f":"IF(AND($I10<=Calculations!$B$56,'CPI-U Index'!$J10>=Calculations!$B$56),1,0)","v":{"$error":"#N/A"}},{"$f":"IF(AND($I10<=Calculations!$B$57,'CPI-U Index'!$J10>=Calculations!$B$57),1,0)","v":{"$error":"#N/A"}},{"$f":"IF(AND($I10<=Calculations!$B$58,'CPI-U Index'!$J10>=Calculations!$B$58),1,0)","v":{"$error":"#N/A"}},{"$f":"IF(AND($I10<=Calculations!$B$59,'CPI-U Index'!$J10>=Calculations!$B$59),1,0)","v":{"$error":"#N/A"}},{"$f":"IF(AND($I10<=Calculations!$B$60,'CPI-U Index'!$J10>=Calculations!$B$60),1,0)","v":{"$error":"#N/A"}},{"$f":"IF(AND($I10<=Calculations!$B$61,'CPI-U Index'!$J10>=Calculations!$B$61),1,0)","v":{"$error":"#N/A"}},{"$f":"IF(AND($I10<=Calculations!$B$62,'CPI-U Index'!$J10>=Calculations!$B$62),1,0)","v":{"$error":"#N/A"}},{"$f":"IF(AND($I10<=Calculations!$B$63,'CPI-U Index'!$J10>=Calculations!$B$63),1,0)","v":{"$error":"#N/A"}},"2016-10-01","2017-09-30",1.4999999999999999E-2,2.2499999999999999E-2,0.06,0.06]
{"$rows_left_out":34}